{"text_format":"1","workbook":"xlsx","n_sheets":4,"sheets":["instructions","checklist situation actuelle","aperçu - lancement actions","aperçu - lancement actions (2)"],"not_rendered":{"charts":10,"images":5,"macros":0,"external_links":0,"defined_names":17,"comments":0,"pivot_tables":0},"unopened":[],"bounds":{"document_bytes":16777216,"sheet_cells":100000,"rows_first":2000,"rows_last":500,"rows_between":2000,"halvings":0,"cell_chars":16384,"cell_head_chars":4096},"cells_cut":0,"cells_raw":0,"read":"whole","date_system":"1900"}

{"sheet":"instructions","index":0,"n_rows":15,"n_cols":1,"rows_kept":15,"cut":false,"hidden":false,"merged":[]}
[]
[]
["Pourquoi cette checklist?"]
["Cette checklist vous aide à réaliser une première évaluation de la politique de sécurité routière dans votre entreprise."]
[]
["Comment vous y prendre?"]
[]
["1/ Remplissez la checklist dans la feuille jaune. Celle-ci évalue la situation actuelle de votre entreprise. "]
["Pour réinitialiser: sélectionnez la colonne H et cliquez sur « Effacer le contenu » pour décocher toutes les cases."]
[]
["2/ Dans la feuille verte, vous verrez ensuite un aperçu de la situation initiale et les potentiels points d'amélioration dans votre entreprise."]
["Cette feuille a été prévue de façon à ce que vous puissiez imprimer tous les éléments sous la forme d’une note pratique."]
[]
["NB : La présente checklist a été développée par la VSV (Fondation flamande en matière de transport et de mobilité) et traduite en français par Ethias. "]
["Vous souhaitez en savoir plus sur les projets de la VSV : cliquez ici"]

{"sheet":"checklist situation actuelle","index":1,"n_rows":92,"n_cols":7,"rows_kept":92,"cut":false,"hidden":false,"merged":[[34,8,39,11]]}
["Renseignements - Nous divisons la politique de sécurité routière d’une entreprise en trois volets: "]
["Volet 1 - disponibilité des données "]
["Volet 2  - facteurs de risques "]
["Volet 3  - vision et mesures existantes"]
[" Pour chaque volet, nous posons un certain nombre de questions. Donnez la réponse la plus adaptée pour chaque question."]
[]
["VOLET 1 - DISPONIBILITÉ DES DONNÉES"]
["D1 - disponibilité des données",null,"description","oui","non","je ne sais pas","N/A"]
[null,"D1.1 chiffres des accidents de la route","Votre entreprise dispose-t-elle d’une banque de données reprenant les chiffres des accidents de la route?"]
[null,"D1.2 moyen de transport","Votre entreprise dispose-t-elle d’une banque de données reprenant des informations sur les moyens de transport qu’utilisent les employés pour le trajet domicile-lieu de travail (y compris les transports en amont et en aval du trajet principal)?"]
[null,"D1.3 infractions routières","Votre entreprise dispose-t-elle d’une banque de données reprenant les amendes pour infractions routières (excès de vitesse et autres)? "]
[null,"D1.4 déplacements de service","Votre entreprise dispose-t-elle d’un aperçu du nombre de déplacements de service, avec répartition par moyen de transport (vélo, transport en commun, voiture)?"]
[null,"D1.5 itinéraires des cyclistes - domicile-lieu de travail","Votre entreprise connait-elle les itinériares empruntés par les cyclistes sur leur trajet domicile-lieu de travail?"]
[null,"D1.6 itinéraires des cyclistes - déplacements de service","Votre entreprise connait-elle les itinéraires empruntés par les cyclistes pour les déplacements de service?"]
[null,"D1.7 port du casque pour cyclistes","Votre entreprise connait-elle le pourcentage d’employés qui portent toujours un casque lorsqu’ils se déplacent à vélo? "]
[null,"D1.8 éclairage vélo ","Votre entreprise connait-elle le pourcentage d’employés qui possèdent un éclairage de vélo fonctionnel? "]
[null,"D1.9 visibilité cyclistes","Votre entreprise connait-elle le pourcentage d’employés qui portent toujours, ou en cas de visibilité réduite, un équipement fluorescent lorsqu’ils se déplacent à vélo? "]
[null,"D1.10 port de la ceinture de sécurité automobilistes","Votre entreprise connait-elle le pourcentage d’employés qui portent la ceinture de sécurité à l’avant et à l’arrière du véhicule? "]
[null,"D1.11 port du casque motocyclistes et cyclomotoristes","Votre entreprise connait-elle le pourcentage d’employés qui portent toujours un casque lorsqu’ils se déplacent en moto ou en cyclomoteur? "]
[]
["VOLET  2 - FACTEURS DE RISQUE"]
["R1 - facteurs de risque général",null,null,"oui","non","je ne sais pas","N/A"]
[null,"R1.1 endroits dangereux","Y a-t-il des endroits dangereux aux abords de votre entreprise où un ou plusieurs accidents ont déjà eu lieu dans le passé? "]
["R2- facteurs de risque piétons",null,null,"oui","non","je ne sais pas","N/A"]
[null,"R2.1 endroits dangereux aux abords de l’entreprise","Y a-t-il des endroits dangereux aux abords de votre entreprise qui peuvent constituer une situation difficile pour les piétons (carrefours dangereux, absence d’infrastructure...)? "]
[null,"R2.1 endroits dangereux sur le domaine privé de l’entreprise","Y a-t-il des endroits dangereux sur le domaine privé de votre entreprise qui peuvent constituer une situation difficile pour les piétons (carrefours dangereux, absence d’infrastructure...)? "]
[null,"R2.2 endroits dangereux sur trajet arrêt transport en commun","Y a-t-il des endroits dangereux pour les piétons sur le trajet entre l’arrêt des transports en commun et le site de l’entreprise?"]
["R3 - facteurs de risque cyclistes",null,null,"oui","non","Je ne sais pas","N/A"]
[null,"R3.1 endroits dangereux sur les itinéraires des cyclistes","Y a-t-il des endroits dangereux sur les itinéraires empruntés par les cyclistes?"]
[null,"R3.2 endroits dangereux sur itinéraires des cyclistes - déplacements de service","Y a-t-il des endroits dangereux  sur les parcours fréquemment empruntés par des cyclistes lors des déplacements de service?"]
{"$rows_left_out":63}
{"sheet":"aperçu - lancement actions","index":2,"n_rows":60,"n_cols":29,"rows_kept":60,"cut":false,"hidden":false,"merged":[[54,10,54,16],[43,10,43,16],[41,10,41,16],[42,10,42,17],[44,10,44,16],[49,10,49,17],[50,10,50,17],[51,10,51,17],[53,10,53,16],[26,10,26,16],[31,10,31,16],[32,10,32,16],[24,10,24,16],[28,10,28,16],[27,10,27,16],[30,1,30,6],[28,1,28,6],[27,1,27,6],[48,10,48,17],[29,1,29,6],[33,10,33,16],[30,10,30,16],[34,1,34,6],[45,10,45,16],[46,10,46,16],[47,10,47,17],[40,10,40,16],[38,10,38,16],[35,10,35,16],[34,10,34,16],[25,1,25,6],[59,21,59,27],[52,21,52,27],[55,21,55,27],[57,21,57,27],[58,21,58,27],[53,21,53,28],[56,21,56,28],[46,21,46,27],[47,21,47,27],[26,1,26,6],[55,10,55,17],[36,10,36,16],[33,1,33,6],[32,1,32,6],[31,1,31,6],[49,21,49,27],[50,21,50,27],[51,21,51,28],[48,21,48,27],[38,21,38,27],[39,21,39,27],[40,21,40,27],[42,21,42,27],[44,21,44,27],[43,21,43,28],[24,21,24,28],[1,1,1,6],[1,10,1,17],[1,21,1,28],[21,1,21,6],[21,10,21,17],[21,21,21,28],[23,1,23,5],[24,1,24,6],[25,21,25,27],[26,21,26,27],[27,21,27,27],[37,21,37,28],[28,21,28,27],[29,21,29,27],[30,21,30,27],[33,21,33,27],[36,21,36,27],[32,21,32,28]]}
[null,"Collecte de données",null,null,null,null,null,null,null,null,"Facteurs de risque",null,null,null,null,null,null,null,null,null,null,"Mesures"]
[null,"Vous retrouvez ci-dessous un aperçu de la collecte de données en matière de sécurité routière dans votre entreprise",null,null,null,null,null,null,null,null,"Vous retrouvez ci-dessous un aperçu de la présence ou de l’absence de facteurs de risque concernant la sécurité routière pour les différents moyens de transport dans votre entreprise",null,null,null,null,null,null,null,null,null,null,"Vous retrouvez ci-dessous un aperçu des mesures de sécurité routière qui ont été prises dans votre entreprises et celles qui doivent encore être prises."]
["Légende",null,null,null,null,null,null,null,null,"Légende",null,"gén.","piétons","vélo","moto / cyclo moteur","voiture","camion","total",null,null,"Légende",null,"vision","piétons","vélo","moto / cyclo moteur","voiture","camion","total"]
["■","est collecté",{"$f":"COUNTIF('checklist situation actuelle'!H$9:H$19,1)","v":0},null,null,null,1,null,null,"■","présent",{"$f":"COUNTIF('checklist situation actuelle'!H$23:H$23,$G4)","v":0},{"$f":"COUNTIF('checklist situation actuelle'!H$25:H$27,$G4)","v":0},{"$f":"COUNTIF('checklist situation actuelle'!H$29:H$35,$G4)","v":0},{"$f":"COUNTIF('checklist situation actuelle'!H$37:H$37,$G4)","v":0},{"$f":"COUNTIF('checklist situation actuelle'!H$39:H$50,$G4)","v":0},{"$f":"COUNTIF('checklist situation actuelle'!H$52:H$54,$G4)","v":0},{"$f":"SUM(L4:Q4)","v":0},null,null,"■","présent",{"$f":"COUNTIF('checklist situation actuelle'!$H$58:$H$64,$G4)","v":0},{"$f":"COUNTIF('checklist situation actuelle'!$H$66:$H$67,$G4)","v":0},{"$f":"COUNTIF('checklist situation actuelle'!$H$69:$H$73,$G4)","v":0},{"$f":"COUNTIF('checklist situation actuelle'!$H$75:$H$77,$G4)","v":0},{"$f":"COUNTIF('checklist situation actuelle'!$H$79:$H$86,$G4)","v":0},{"$f":"COUNTIF('checklist situation actuelle'!$H$88:$H$92,$G4)","v":0},{"$f":"SUM(W4:AB4)","v":0}]
["□","pas encore collecté",{"$f":"COUNTIF('checklist situation actuelle'!H$9:H$19,2)","v":0},null,null,null,2,null,null,"□","absent",{"$f":"COUNTIF('checklist situation actuelle'!H$23:H$23,$G5)","v":0},{"$f":"COUNTIF('checklist situation actuelle'!H$25:H$27,$G5)","v":0},{"$f":"COUNTIF('checklist situation actuelle'!H$29:H$35,$G5)","v":0},{"$f":"COUNTIF('checklist situation actuelle'!H$37:H$37,$G5)","v":0},{"$f":"COUNTIF('checklist situation actuelle'!H$39:H$50,$G5)","v":0},{"$f":"COUNTIF('checklist situation actuelle'!H$52:H$54,$G5)","v":0},{"$f":"SUM(L5:Q5)","v":0},null,null,"□","absent",{"$f":"COUNTIF('checklist situation actuelle'!$H$58:$H$64,$G5)","v":0},{"$f":"COUNTIF('checklist situation actuelle'!$H$66:$H$67,$G5)","v":0},{"$f":"COUNTIF('checklist situation actuelle'!$H$69:$H$73,$G5)","v":0},{"$f":"COUNTIF('checklist situation actuelle'!$H$75:$H$77,$G5)","v":0},{"$f":"COUNTIF('checklist situation actuelle'!$H$79:$H$86,$G5)","v":0},{"$f":"COUNTIF('checklist situation actuelle'!$H$88:$H$92,$G5)","v":0},{"$f":"SUM(W5:AB5)","v":0}]
["?","je ne sais pas",{"$f":"COUNTIF('checklist situation actuelle'!H$9:H$19,3)","v":0},null,null,null,3,null,null,"?","je ne sais pas",{"$f":"COUNTIF('checklist situation actuelle'!H$23:H$23,$G6)","v":0},{"$f":"COUNTIF('checklist situation actuelle'!H$25:H$27,$G6)","v":0},{"$f":"COUNTIF('checklist situation actuelle'!H$29:H$35,$G6)","v":0},{"$f":"COUNTIF('checklist situation actuelle'!H$37:H$37,$G6)","v":0},{"$f":"COUNTIF('checklist situation actuelle'!H$39:H$50,$G6)","v":0},{"$f":"COUNTIF('checklist situation actuelle'!H$52:H$54,$G6)","v":0},{"$f":"SUM(L6:Q6)","v":0},null,null,"?","je ne sais pas",{"$f":"COUNTIF('checklist situation actuelle'!$H$58:$H$64,$G6)","v":0},{"$f":"COUNTIF('checklist situation actuelle'!$H$66:$H$67,$G6)","v":0},{"$f":"COUNTIF('checklist situation actuelle'!$H$69:$H$73,$G6)","v":0},{"$f":"COUNTIF('checklist situation actuelle'!$H$75:$H$77,$G6)","v":0},{"$f":"COUNTIF('checklist situation actuelle'!$H$79:$H$86,$G6)","v":0},{"$f":"COUNTIF('checklist situation actuelle'!$H$88:$H$92,$G6)","v":0},{"$f":"SUM(W6:AB6)","v":0}]
["/","non complété",{"$f":"11-SUM(C4:C6,C8)","v":11},null,null,null,0,null,null,"/","non complété",{"$f":"1-SUM(L4:L6,L8)","v":1},{"$f":"3-SUM(M4:M6,M8)","v":3},{"$f":"7-SUM(N4:N6,N8)","v":7},{"$f":"1-SUM(O4:O6,O8)","v":1},{"$f":"12-SUM(P4:P6,P8)","v":12},{"$f":"2-SUM(Q4:Q6,Q8)","v":2},{"$f":"26-SUM(R4:R6,R8)","v":26},null,null,"/","non complété",{"$f":"7-SUM(W4:W6,W8)","v":7},{"$f":"2-SUM(X4:X6,X8)","v":2},{"$f":"5-SUM(Y4:Y6,Y8)","v":5},{"$f":"3-SUM(Z4:Z6,Z8)","v":3},{"$f":"8-SUM(AA4:AA6,AA8)","v":8},{"$f":"5-SUM(AB4:AB6,AB8)","v":5},{"$f":"30-SUM(AC4:AC6,AC8)","v":30}]
["x","ne s’applique pas",{"$f":"COUNTIF('checklist situation actuelle'!H$9:H$19,4)","v":0},null,null,null,4,null,null,"x","ne s’applique pas",{"$f":"COUNTIF('checklist situation actuelle'!H$23:H$23,$G8)","v":0},{"$f":"COUNTIF('checklist situation actuelle'!H$25:H$27,$G8)","v":0},{"$f":"COUNTIF('checklist situation actuelle'!H$29:H$35,$G8)","v":0},{"$f":"COUNTIF('checklist situation actuelle'!H$37:H$37,$G8)","v":0},{"$f":"COUNTIF('checklist situation actuelle'!H$39:H$50,$G8)","v":0},{"$f":"COUNTIF('checklist situation actuelle'!H$52:H$54,$G8)","v":0},{"$f":"SUM(L8:Q8)","v":0},null,null,"x","ne s’applique pas",{"$f":"COUNTIF('checklist situation actuelle'!$H$58:$H$64,$G8)","v":0},{"$f":"COUNTIF('checklist situation actuelle'!$H$66:$H$67,$G8)","v":0},{"$f":"COUNTIF('checklist situation actuelle'!$H$69:$H$73,$G8)","v":0},{"$f":"COUNTIF('checklist situation actuelle'!$H$75:$H$77,$G8)","v":0},{"$f":"COUNTIF('checklist situation actuelle'!$H$79:$H$86,$G8)","v":0},{"$f":"COUNTIF('checklist situation actuelle'!$H$88:$H$92,$G8)","v":0},{"$f":"SUM(W8:AB8)","v":0}]
[null,null,null,null,null,null,null,null,null,null,null,"général","piétons","vélo","moto / cyclomoteur","voiture","camion",null,null,null,null,null,"vision","piétons","vélo","moto / cyclomoteur","voiture","camion"]
[]
[]
[]
[]
[]
[]
[]
[]
[]
[]
[]
[]
[null,"Les symboles indiquent les données que votre entreprise doit encore collecter.",null,null,null,null,null,null,null,null,"Les symboles indiquent les facteurs de risque présents dans votre entreprise.",null,null,null,null,null,null,null,null,null,null,"Les symboles indiquent les mesures supplémentaires à prendre dans votre entreprise."]
[]
[null,"Eléments pour lesquels l’entreprise peut collecter des informations",null,null,null,null,null,null,null,"R1 - facteurs de risque général",null,null,null,null,null,null,null,null,null,null,"M1 - vision et stratégie"]
[{"$f":"IF('checklist situation actuelle'!H9=1,\"■\",IF('checklist situation actuelle'!H9=2,\"□\",IF('checklist situation actuelle'!H9=3,\"?\",IF('checklist situation actuelle'!H9=4,\"x\",IF('checklist situation actuelle'!H9=0,\"/\",\"!?\")))))","v":"/"},"Chiffres des accidents de la route ",null,null,null,null,null,null,null,{"$f":"IF('checklist situation actuelle'!H23=1,\"■\",IF('checklist situation actuelle'!H23=2,\"□\",IF('checklist situation actuelle'!H23=3,\"?\",IF('checklist situation actuelle'!H23=4,\"x\",IF('checklist situation actuelle'!H23=0,\"/\",\"!?\")))))","v":"/"},"Endroits dangereux aux abords de l’entreprise",null,null,null,null,null,null,null,null,null,{"$f":"IF('checklist situation actuelle'!H58=1,\"■\",IF('checklist situation actuelle'!H58=2,\"□\",IF('checklist situation actuelle'!H58=3,\"?\",IF('checklist situation actuelle'!H58=4,\"x\",IF('checklist situation actuelle'!H58=0,\"/\",\"!?\")))))","v":"/"},"Réalisation d’une politique ou d’un plan de sécurité routière (éventuellement intégration dans un Plan global de prévention)"]
[{"$f":"IF('checklist situation actuelle'!H10=1,\"■\",IF('checklist situation actuelle'!H10=2,\"□\",IF('checklist situation actuelle'!H10=3,\"?\",IF('checklist situation actuelle'!H10=4,\"x\",IF('checklist situation actuelle'!H10=0,\"/\",\"!?\")))))","v":"/"},"Les moyens de transport utilisés par les employés pour le trajet domicile-lieu de travail (y compris les transports en amont et en aval du trajet)",null,null,null,null,null,null,null,"R2- facteurs de risque piétons",null,null,null,null,null,null,null,null,null,null,{"$f":"IF('checklist situation actuelle'!H59=1,\"■\",IF('checklist situation actuelle'!H59=2,\"□\",IF('checklist situation actuelle'!H59=3,\"?\",IF('checklist situation actuelle'!H59=4,\"x\",IF('checklist situation actuelle'!H59=0,\"/\",\"!?\")))))","v":"/"},"Élaboration d’une culture de la sécurité routière dans l’entreprise (p. ex. règles claires sur l’alcool, vérification éclairage vélo...)"]
[{"$f":"IF('checklist situation actuelle'!H11=1,\"■\",IF('checklist situation actuelle'!H11=2,\"□\",IF('checklist situation actuelle'!H11=3,\"?\",IF('checklist situation actuelle'!H11=4,\"x\",IF('checklist situation actuelle'!H11=0,\"/\",\"!?\")))))","v":"/"},"Amendes pour infractions routières",null,null,null,null,null,null,null,{"$f":"IF('checklist situation actuelle'!H25=1,\"■\",IF('checklist situation actuelle'!H25=2,\"□\",IF('checklist situation actuelle'!H25=3,\"?\",IF('checklist situation actuelle'!H25=4,\"x\",IF('checklist situation actuelle'!H25=0,\"/\",\"!?\")))))","v":"/"},"Endroits dangereux sur le trajet domicile-lieu de travail (en amont, en aval du trajet et/ou sur le trajet principal)",null,null,null,null,null,null,null,null,null,{"$f":"IF('checklist situation actuelle'!H60=1,\"■\",IF('checklist situation actuelle'!H60=2,\"□\",IF('checklist situation actuelle'!H60=3,\"?\",IF('checklist situation actuelle'!H60=4,\"x\",IF('checklist situation actuelle'!H60=0,\"/\",\"!?\")))))","v":"/"},"Signature de la Charte européenne de la sécurité routière"]
[{"$f":"IF('checklist situation actuelle'!H12=1,\"■\",IF('checklist situation actuelle'!H12=2,\"□\",IF('checklist situation actuelle'!H12=3,\"?\",IF('checklist situation actuelle'!H12=4,\"x\",IF('checklist situation actuelle'!H12=0,\"/\",\"!?\")))))","v":"/"},"Nombre de déplacements de service par moyen de transport",null,null,null,null,null,null,null,{"$f":"IF('checklist situation actuelle'!H26=1,\"■\",IF('checklist situation actuelle'!H26=2,\"□\",IF('checklist situation actuelle'!H26=3,\"?\",IF('checklist situation actuelle'!H26=4,\"x\",IF('checklist situation actuelle'!H26=0,\"/\",\"!?\")))))","v":"/"},"Endroits dangereux sur le domaine privé",null,null,null,null,null,null,null,null,null,{"$f":"IF('checklist situation actuelle'!H61=1,\"■\",IF('checklist situation actuelle'!H61=2,\"□\",IF('checklist situation actuelle'!H61=3,\"?\",IF('checklist situation actuelle'!H61=4,\"x\",IF('checklist situation actuelle'!H61=0,\"/\",\"!?\")))))","v":"/"},"Elaboration (et communication) de codes de conduite en matière de conduite sûre"]
[{"$f":"IF('checklist situation actuelle'!H13=1,\"■\",IF('checklist situation actuelle'!H13=2,\"□\",IF('checklist situation actuelle'!H13=3,\"?\",IF('checklist situation actuelle'!H13=4,\"x\",IF('checklist situation actuelle'!H13=0,\"/\",\"!?\")))))","v":"/"},"Itinéraires cyclistes empruntés pour les trajets domicile-lieu de travail",null,null,null,null,null,null,null,{"$f":"IF('checklist situation actuelle'!H27=1,\"■\",IF('checklist situation actuelle'!H27=2,\"□\",IF('checklist situation actuelle'!H27=3,\"?\",IF('checklist situation actuelle'!H27=4,\"x\",IF('checklist situation actuelle'!H27=0,\"/\",\"!?\")))))","v":"/"},"Endroits dangereux sur le chemin pour piétons vers l’arrêt des transports en commun",null,null,null,null,null,null,null,null,null,{"$f":"IF('checklist situation actuelle'!H62=1,\"■\",IF('checklist situation actuelle'!H62=2,\"□\",IF('checklist situation actuelle'!H62=3,\"?\",IF('checklist situation actuelle'!H62=4,\"x\",IF('checklist situation actuelle'!H62=0,\"/\",\"!?\")))))","v":"/"},"Éviter les déplacements si possible (téléconférence, télétravail...)"]
[{"$f":"IF('checklist situation actuelle'!H14=1,\"■\",IF('checklist situation actuelle'!H14=2,\"□\",IF('checklist situation actuelle'!H14=3,\"?\",IF('checklist situation actuelle'!H14=4,\"x\",IF('checklist situation actuelle'!H14=0,\"/\",\"!?\")))))","v":"/"},"Itinéraires cyclistes empruntés pour les déplacements de service ",null,null,null,null,null,null,null,"R3 - facteurs de risque cyclistes",null,null,null,null,null,null,null,null,null,null,{"$f":"IF('checklist situation actuelle'!H63=1,\"■\",IF('checklist situation actuelle'!H63=2,\"□\",IF('checklist situation actuelle'!H63=3,\"?\",IF('checklist situation actuelle'!H63=4,\"x\",IF('checklist situation actuelle'!H63=0,\"/\",\"!?\")))))","v":"/"},"Attention à la sécurité routière sur le site privé"]
{"$rows_left_out":31}
{"sheet":"aperçu - lancement actions (2)","index":3,"n_rows":154,"n_cols":10,"rows_kept":154,"cut":false,"hidden":false,"merged":[[151,2,151,8],[152,2,152,8],[154,2,154,8],[1,2,1,9],[24,2,24,9],[25,2,25,9],[21,2,21,9],[153,2,153,8],[146,2,146,8],[147,2,147,9],[150,2,150,9],[91,2,91,8],[92,2,92,9],[149,2,149,8],[143,2,143,8],[144,2,144,8],[138,2,138,8],[145,2,145,9],[142,2,142,8],[141,2,141,8],[137,2,137,9],[140,2,140,8],[134,2,134,8],[136,2,136,8],[87,2,87,9],[86,2,86,9],[127,2,127,9],[121,2,121,8],[125,2,125,8],[133,2,133,8],[88,2,88,9],[130,2,130,8],[131,2,131,9],[128,2,128,8],[132,2,132,8],[123,2,123,8],[80,2,80,8],[124,2,124,8],[79,2,79,9],[81,2,81,8],[82,2,82,8],[83,2,83,8],[122,2,122,8],[84,2,84,9],[85,2,85,9],[90,2,90,8],[28,2,28,7],[65,2,65,8],[72,2,72,8],[73,2,73,8],[29,2,29,7],[30,2,30,7],[31,2,31,7],[68,2,68,8],[32,2,32,7],[75,2,75,8],[69,2,69,8],[33,2,33,7],[70,2,70,8],[34,2,34,7],[23,2,23,6],[61,2,61,8],[119,2,119,9],[120,2,120,8],[38,2,38,9],[96,2,96,9],[58,2,58,9],[116,2,116,9],[26,2,26,7],[63,2,63,8],[27,2,27,7],[64,2,64,8],[71,2,71,8],[67,2,67,8],[78,2,78,8],[77,2,77,8]]}
[null,null,"Collecte de données"]
[null,null,"Vous retrouvez ci-dessous un aperçu de la collecte de données en matière de sécurité routière dans votre entreprise"]
[null,"Légende"]
[null,"■","est collecté",{"$f":"COUNTIF('checklist situation actuelle'!H$9:H$19,1)","v":0},null,null,null,1]
[null,"□","pas encore collecté",{"$f":"COUNTIF('checklist situation actuelle'!H$9:H$19,2)","v":0},null,null,null,2]
[null,"?","je ne sais pas",{"$f":"COUNTIF('checklist situation actuelle'!H$9:H$19,3)","v":0},null,null,null,3]
[null,"/","non complété",{"$f":"11-SUM(D4:D6,D8)","v":11},null,null,null,0]
[null,"x","N/A",{"$f":"COUNTIF('checklist situation actuelle'!H$9:H$19,4)","v":0},null,null,null,4]
[]
[]
[]
[]
[]
[]
[]
[]
[]
[]
[]
[]
[]
[null,null,"Les symboles indiquent les données que votre entreprise peut encore collecter en supplément."]
[]
[null,null,"Eléments pour lesquels l’entreprise peut collecter des informations"]
[null,{"$f":"IF('checklist situation actuelle'!H9=1,\"■\",IF('checklist situation actuelle'!H9=2,\"□\",IF('checklist situation actuelle'!H9=3,\"?\",IF('checklist situation actuelle'!H9=4,\"x\",IF('checklist situation actuelle'!H9=0,\"/\",\"!?\")))))","v":"/"},"Chiffres des accidents de la route"]
[null,{"$f":"IF('checklist situation actuelle'!H10=1,\"■\",IF('checklist situation actuelle'!H10=2,\"□\",IF('checklist situation actuelle'!H10=3,\"?\",IF('checklist situation actuelle'!H10=4,\"x\",IF('checklist situation actuelle'!H10=0,\"/\",\"!?\")))))","v":"/"},"Les moyens de transport utilisés par les employés pour le trajet domicile-lieu de travail (y compris les transports en amont et en aval du trajet)"]
[null,{"$f":"IF('checklist situation actuelle'!H11=1,\"■\",IF('checklist situation actuelle'!H11=2,\"□\",IF('checklist situation actuelle'!H11=3,\"?\",IF('checklist situation actuelle'!H11=4,\"x\",IF('checklist situation actuelle'!H11=0,\"/\",\"!?\")))))","v":"/"},"Amendes pour infractions routières"]
[null,{"$f":"IF('checklist situation actuelle'!H12=1,\"■\",IF('checklist situation actuelle'!H12=2,\"□\",IF('checklist situation actuelle'!H12=3,\"?\",IF('checklist situation actuelle'!H12=4,\"x\",IF('checklist situation actuelle'!H12=0,\"/\",\"!?\")))))","v":"/"},"Nombre de déplacements de service par moyen de transport"]
[null,{"$f":"IF('checklist situation actuelle'!H13=1,\"■\",IF('checklist situation actuelle'!H13=2,\"□\",IF('checklist situation actuelle'!H13=3,\"?\",IF('checklist situation actuelle'!H13=4,\"x\",IF('checklist situation actuelle'!H13=0,\"/\",\"!?\")))))","v":"/"},"Itinéraires empruntés par les cyclistes pour les trajets domicile-lieu de travail"]
[null,{"$f":"IF('checklist situation actuelle'!H14=1,\"■\",IF('checklist situation actuelle'!H14=2,\"□\",IF('checklist situation actuelle'!H14=3,\"?\",IF('checklist situation actuelle'!H14=4,\"x\",IF('checklist situation actuelle'!H14=0,\"/\",\"!?\")))))","v":"/"},"Itinéraires empruntés par les cyclistes pour les déplacements de service "]
{"$rows_left_out":124}